Human body
type: Ontology
creator: Hans Cools, MD, Agfa Healthcare/Belgium
contributor: "Until 2010: Pieterjan De Potter, Ghent University - IBBT/ELIS - Multimedia Lab/Belgium
publisher: Agfa Healthcare/Belgium
description: Formal general description of human body.
format: OWL Full

human body
type: Class
definition: The whole body of a human.
subclass of: Resource
subclass of: Restriction
  on property: complexityOf
  some values from: Human

Concept
in scheme: sct20080731
notation: 38266002

newborn body
type: Class
definition: The whole body of a newborn human.
subclass of: Restriction
  on property: complexityOf
  some values from: Newborn
subclass of: Restriction
  on property: hasWeight
  some values from: human body birth weight

human dead body
type: Class
definition: Remainings of a human after life.
subclass of: Resource
subclass of: SpatialResource
subclass of: Restriction
  on property: hasState
  has value: Dead
subclass of: Restriction
  on property: hasComplexity
  some values from: human body

Concept
in scheme: sct20080731
notation: 406139003

human death
type: Class
definition: Finding of a human body that stopped being a human.
subclass of: Death
subclass of: Restriction
  on property: hasAgent
  some values from: human dead body

human body substance
type: Class
definition: Any sui generis substance contained by a human body.
subclass of: Resource
subclass of: Restriction
  on property: containedBy
  some values from: human body

Concept
in scheme: sct20080731
notation: 91720002

human body structure
type: Class
definition: Any structural part of the human body.
note: This can be a site as object of a disease or a procedure.
subclass of: human body substance

Concept
in scheme: sct20080731
notation: 123037004

human anatomical structure
type: Class
definition: Human structure of any kind as result of species evolution.
subclass of: human body structure

Concept
in scheme: sct20080731
notation: 91723000

acquired human body structure
type: Class
definition: Any acquired human body structure, e.g. a scar, an amputation stump.
subclass of: human body structure
disjoint with: human anatomical structure

Concept
in scheme: sct20080731
notation: 280115004

human body surface
type: Class
definition: Outer surface of a human body.
subclass of: OuterSurface

human body length
type: Class
definition: Length as physical property of a human body.
subclass of: Length
subclass of: Observable

measuring a human body length
type: Class
definition: Measuring of the length of a human body from the vertex to the sole of the foot in upright position.
subclass of: Examining
subclass of: Restriction
  on property: hasInput
  all values from: human body length
subclass of: Restriction
  on property: hasOutput
  all values from: human body length measurement

human body length measurement
type: Class
definition: Measurement of the length of a human body from the vertex to the sole of the foot in upright position.
subclass of: Measurement
subclass of: Restriction
  on property: measurementOf
  some values from: human body length
subclass of: Restriction
  on property: outputOf
  some values from: measuring a human body length

Concept
in scheme: sct20080731
notation: 248334005

human body surface area
type: Class
definition: Area as physical property of a human body surface.
subclass of: Area

human body surface area measurement
type: Class
definition: Measurement of an area of a human body surface.
comment: Approximative calculation, e.g. in an N3 rule with formula of Mosteller, see http://eulersharp.sourceforge.net/2003/03swap/bodySurfaceArea_rules.
subclass of: Measurement
subclass of: Restriction
  on property: measurementOf
  some values from: human body surface area

human body weight
type: Class
definition: Mass as physical property of a human body, since abstraction made of the gravitational acceleration.
subclass of: Mass

human body birth weight
type: Class
definition: Mass of a human body at birth.
subclass of: human body weight

weighing a human body
type: Class
definition: Measuring a weight of a human body.
subclass of: Examining
subclass of: Restriction
  on property: hasInput
  all values from: human body weight
subclass of: Restriction
  on property: hasOutput
  all values from: human body weight measurement

Concept
in scheme: sct20080731
notation: 39857003

human body weight measurement
type: Class
definition: Measurement of a weight of a human body.
subclass of: Measurement
subclass of: Restriction
  on property: measurementOf
  some values from: human body weight
subclass of: Restriction
  on property: outputOf
  some values from: weighing a human body

Concept
in scheme: sct20080731
notation: 27113001

human body birth weight measurement
type: Class
definition: Measurement of a weight of a human body at birth.
subclass of: human body weight measurement
subclass of: Restriction
  on property: measurementOf
  some values from: human body birth weight
subclass of: Restriction
  on property: outputOf
  some values from: weighing a human body

Concept
in scheme: sct20080731
notation: 364589006

human body weighing device
type: Class
definition: Device to measure the human body weight.
subclass of: WeighingDevice
subclass of: Restriction
  on property: actsIn
  all values from: weighing a human body
subclass of: Restriction
  on property: weighs
  all values from: human body

weight status
type: Class
definition: Status of a human's weight
subclass of: Finding
one of: severely underweight
one of: underweight
one of: normal weight
one of: overweight
one of: obese
one of: morbidly obese
one of: super obese

severely underweight
type: weight status
definition: A human's body weight being severely low.
comment: Body mass index lower than 16 kg/m2.
subclass of: RiskFactor

underweight
type: weight status
definition: A human's body weight being too low.
comment: Body mass index ranging 16-18.4 kg/m2.
subclass of: RiskFactor

Concept
in scheme: sct20080731
notation: 248342006

normal weight
type: weight status
definition: A human's body weight being normal.
comment: Body mass index ranging 18.5-24.9 kg/m2.

Concept
in scheme: sct20080731
notation: 63976003

overweight
type: weight status
definition: A human's body weight being too high.
comment: Body mass index ranging 25-29.9 kg/m2.
subclass of: RiskFactor

Concept
in scheme: sct20080731
notation: 238131007

obese
type: weight status
definition: A human's body weight being pathologic.
comment: Body mass index ranging 30-34.9 kg/m2.
subclass of: RiskFactor

Concept
in scheme: sct20080731
notation: 414915002

morbidly obese
type: weight status
definition: A human's body weight being severely pathologic.
comment: Body mass index ranging 35-44.9 kg/m2.
subclass of: RiskFactor

super obese
type: weight status
definition: A human's body weight being extremely pathologic.
comment: Body mass index over 44.9 kg/m2.
subclass of: RiskFactor

adult body mass index
type: Class
definition: Physical quantity expressing total body fat based on body length and body weight applying to adult men and women.
subclass of: PhysicalQuantity

adult body mass index measurement
type: Class
definition: Estimation of total body fat based on body length and body weight applying to adult men and women.
comment: May overestimate body fat in athletes and others who have a muscular build; may underestimate body fat in older persons and others who have lost muscle mass.
subclass of: Measurement
subclass of: Restriction
  on property: measurementOf
  some values from: adult body mass index
subclass of: Restriction
  on property: hasUnit
  some values from: kilogramPerMeterSquare

hasLength
type: ObjectProperty
definition: Specifying a human's body length.
sub property of: hasLength
domain: human body
range: human body length

hasSurfaceArea
type: ObjectProperty
definition: Specifying a human's body surface area.
sub property of: hasArea
domain: human body
range: human body surface area

hasWeight
type: ObjectProperty
definition: Specifying a human's body weight.
sub property of: hasMass
domain: human body
range: human body weight

weightOf
type: ObjectProperty
definition: Specifying a human body having a weight.
sub property of: massOf
domain: human body weight
range: human body

hasBirthWeight
type: ObjectProperty
definition: Specifying a human's body weight at birth.
sub property of: hasWeight
domain: human body
range: human body birth weight

hasBodyMassIndex
type: ObjectProperty
definition: Specifying a body mass index of a human adult's body'.
domain: human body
range: adult body mass index

hasWeightStatus
type: ObjectProperty
definition: Specifying a human body's weight status.
domain: human body
range: weight status