Human
type: Ontology
creator: Hans Cools, MD, Agfa Healthcare/Belgium
contributor: "Until 2010: Pieterjan De Potter, Pedro Debevere, Ghent University - IBBT/ELIS - Multimedia Lab/Belgium
publisher: Agfa Healthcare/Belgium
description: Formal general description of human.
format: OWL Full

human
type: Class
definition: Member of the subspecies Homo sapiens sapiens.
subclass of: Restriction
  on property: hasComplexity
  some values from: Body
subclass of: Restriction
  on property: hasParent
  all values from: biological human parent
subclass of: Restriction
  on property: hasTaxon
  all values from: SubspeciesHomoSapiensSapiens

Concept
in scheme: sct20080731
notation: 337915000

SubspeciesHomoSapiensSapiens
type: Class
type: Taxon
scientific name: Homo sapiens sapiens
rank: Subspecies
subclass of: http://purl.uniprot.org/taxonomy/9606

human fetus
type: Class
definition: Immature human in the uterus after the end of the second month of gestation.
subclass of: human

Concept
in scheme: sct20080731
notation: 410599005

newborn
type: Class
definition: A newborn infant.
subclass of: human
subclass of: Restriction
  on property: weighs
  some values from: BirthWeight

biological gender
type: Class
definition: Biological gender of a human.
one of: humanly male
one of: humanly female
one of: human intersexual

humanly male
type: Class
type: biological gender
definition: Being of a human male gender.
disjoint with: Pregnant

Concept
in scheme: sct20080731
notation: 248153007

humanly female
type: Class
type: biological gender
definition: Being of a human female gender.

Concept
in scheme: sct20080731
notation: 248152002

human intersexual
type: Class
type: biological gender
definition: Being of a gender that is neither male or female, with biological characteristics of both.
disjoint with: Pregnant

human female
type: Class
definition: Human of the female biological gender.
subclass of: human
subclass of: Restriction
  on property: hasBiologicalGender
  some values from: humanly female

human male
type: Class
definition: Human of the male biological gender.
subclass of: human
subclass of: Restriction
  on property: hasBiologicalGender
  some values from: humanly male

intersexual
type: Class
definition: Human of the intersexual biological gender.
subclass of: human
subclass of: Restriction
  on property: hasBiologicalGender
  some values from: human intersexual

administrative gender
type: Class
definition: Officially registered gender of a human.
one of: administrative male
one of: administrative female

administrative male
type: Class
type: administrative gender
definition: Being officially registered as male.
note: Can differ from the biological gender.

administrative female
type: Class
type: administrative gender
definition: Being officially registered as female.
note: Can differ from the biological gender.

human life
type: Class
definition: Life of a human.
note: No satisfying description of onset of a human life.
subclass of: Life

person
type: Class
definition: A living born human.
comment: human:Human members live and are not necessarily born; foaf:Person members are dead or alive, but born. External conflict: foaf:Person rdfs:subClassOf wordnet:person and wordnet:person wordnet:hyponymOf wordnet:organism, and wordnet:organism wordnet:hyponymOf wordnet:livingThing, but not 'hard coded' since wordnet:hyponymOf used instead of rdfs:subClassOf.
note: A fetus is not considered as a person, who can have e.g. a health record. The fetus is mentioned in the health record of the mother. The moment the fetus becomes a newborn the fetus part of the record becomes the record of the newborn.
intersection of: human
intersection of: Person

person life
type: Class
definition: Life of a person.
subclass of: human life
subclass of: IndividualLife

immature human
type: Class
definition: Biologically not full-grown person.
subclass of: person
subclass of: ImmatureOrganism

Concept
in scheme: sct20080731
notation: 410599005

biologically adult human
type: Class
definition: Person having attained reproductive ability or evidencing secondary sex characteristics.
subclass of: person
subclass of: MatureOrganism
subclass of: Restriction
  on property: hasChild
  all values from: person

Concept
in scheme: sct20080731
notation: 133936004

legally adult human
type: Class
definition: Person being adult as stated by law.
note: Further restriction to be given along specific law.
subclass of: person

woman
type: Class
definition: Adult human female.
subclass of: human female
subclass of: biologically adult human

Concept
in scheme: sct20080731
notation: 224526002

women
type: Class
definition: Group of which a woman is a member.
disjoint with: men
subclass of: Group
subclass of: Restriction
  on property: member
  all values from: woman

pregnant woman
type: Class
definition: Woman with offspring developing in her body.
subclass of: woman
subclass of: PregnantOrganism
subclass of: Restriction
  on property: hasGravidity
  some values from: Pregnant

Concept
in scheme: sct20080731
notation: 255409004

man
type: Class
definition: Adult human male.
subclass of: human male
subclass of: biologically adult human

Concept
in scheme: sct20080731
notation: 339947000

men
type: Class
definition: Group of which a man is a member.
subclass of: Group
subclass of: Restriction
  on property: member
  all values from: man

biological human parent
type: Class
definition: First grade living ascendant of a human.
subclass of: Parent
subclass of: biologically adult human

Concept
in scheme: sct20080731
notation: 13646006

legal human parent
type: Class
definition: Parent of a human as stated by law.

human role
type: Class
definition: A role a human can play.
subclass of: Restriction
  on property: rolePlayedBy
  all values from: human

person role
type: Class
definition: A role a person can play as a social entity.
intersection of: human role
intersection of: Person
intersection of: Restriction
  on property: rolePlayedBy
  all values from: person

human occupation
type: Class
definition: Human action serving as one's regular source of livelihood.
subclass of: Action

occupation role
type: Class
definition: Role of a person with an occupation.
subclass of: person role

Concept
in scheme: sct20080731
notation: 14679004

occupational status
type: Class
definition: State of a person's occupation.
subclass of: State

contact person role
type: Class
definition: Person that can be contacted about something.
subclass of: person role

Concept
in scheme: sct20080731
notation: 70862002

language expressing
type: Class
definition: Human expressing a language.
subclass of: Action
subclass of: Restriction
  on property: hasAgent
  some values from: person

language expression
type: Class
definition: Human expression in a language.
subclass of: Restriction
  on property: outputOf
  some values from: language expressing

linguistic skill
type: Class
definition: Person's skill concerning a language.
subclass of: Ability
subclass of: Restriction
  on property: abilityOf
  some values from: person
subclass of: Restriction
  on property: hasObject
  some values from: Language
subclass of: Restriction
  on property: hasLevel
  some values from: linguistic skill level

language understanding skill
type: Class
definition: Skilled to understand a language.
subclass of: linguistic skill

language expression skill
type: Class
definition: Skilled to express in a language.
subclass of: linguistic skill

language speaking skill
type: Class
type: language expression skill
definition: Skilled to speak a language.

language writing skill
type: Class
type: language expression skill
definition: Skilled to write in a language.

language signing skill
type: Class
type: language expression skill
definition: Skilled to sign in a language.

linguistic skill level
type: Class
definition: Person's skill level concerning a language.
subclass of: Level
one of: native linguistic skill
one of: fluent linguistic skill
one of: good linguistic skill
one of: average linguistic skill
one of: poor linguistic skill
one of: notices linguistic skill
one of: no linguistic skill

native linguistic skill
type: Class
type: linguistic skill level
definition: Linguistic skill level of a person raised in that language.

fluent linguistic skill
type: Class
type: linguistic skill level
definition: Fluent linguistic skill level of a person.

good linguistic skill
type: Class
type: linguistic skill level
definition: Good linguistic skill level of a person.

average linguistic skill
type: Class
type: linguistic skill level
definition: Average linguistic skill level of a person.

poor linguistic skill
type: Class
type: linguistic skill level
definition: Poor linguistic skill level of a person.

notices linguistic skill
type: Class
type: linguistic skill level
definition: Linguistic skill level of a person having only notices of a language.

no linguistic skill
type: Class
type: linguistic skill level
definition: Linguistic skill level of a person having no knowledge of a language.

advance directives report
type: Class
definition: Report with a person's advance directives about treatment and who can decide in place in case the person cannot decide anymore.
subclass of: Report

Concept
in scheme: sct20080731
notation: 371538006

informed consent
type: Class
definition: .

spoken language understanding skill
type: Class
type: language understanding skill
definition: Skilled to understand spoken language.

written language understanding skill
type: Class
type: language understanding skill
definition: Skilled to understand written language.

signed language understanding skill
type: Class
type: language understanding skill
definition: Skilled to understand signed language.

working
type: Class
type: occupational status
definition: Occupational status of having a job.

retired
type: Class
type: occupational status
definition: Occupational status of having stopped working.

on sick leave
type: Class
type: occupational status
definition: Occupational status of having stopped working due to a health disorder.

hasBiologicalGender
type: ObjectProperty
definition: Specifying the biological gender of a human.
domain: human
range: biological gender

hasAdministrativeGender
type: ObjectProperty
definition: Specifying the officially registered gender of a person.
sub property of: gender
domain: person
range: administrative gender

weighs
type: ObjectProperty
definition: Specifying a human's weight measurement.
property chain axiom: hasComplexity
property chain axiom: hasWeight
property chain axiom: hasMeasurement
domain: human
range: WeightMeasurement

weighsAtBirth
type: ObjectProperty
definition: Specifying a human's birth weight measurement.
property chain axiom: hasComplexity
property chain axiom: hasBirthWeight
property chain axiom: hasMeasurement
domain: person
range: WeightMeasurement

hasLength
type: ObjectProperty
definition: Specifying a human's length measurement.
property chain axiom: hasComplexity
property chain axiom: hasLength
property chain axiom: hasMeasurement
domain: human
range: LengthMeasurement

hasSurfaceArea
type: ObjectProperty
definition: Specifying a human's surface area measurement.
property chain axiom: hasComplexity
property chain axiom: hasSurfaceArea
property chain axiom: hasMeasurement
domain: human
range: SurfaceAreaMeasurement

hasBodyMassIndex
type: ObjectProperty
definition: Specifying an adult human's body mass index measurement.
property chain axiom: hasComplexity
property chain axiom: hasBodyMassIndex
property chain axiom: hasMeasurement
domain: human
range: AdultBodyMassIndexMeasurement

hasWeightStatus
type: ObjectProperty
definition: Specifying a body weight status of a human.
property chain axiom: hasComplexity
property chain axiom: hasWeightStatus
domain: human
range: WeightStatus

hasOccupationalStatus
type: ObjectProperty
definition: Specifying a status of a person's occupation.
domain: person
range: occupational status

hasContactPerson
type: ObjectProperty
definition: Specifying a contact person of another person.
domain: person
range: Restriction
  on property: playsRole
  some values from: contact person role

contactPersonOf
type: ObjectProperty
definition: Specifying a person having a contact person.
domain: Restriction
  on property: playsRole
  some values from: contact person role
range: person

forWhichIsContactPerson
type: ObjectProperty
definition: Specifying a person that can be contacted about something.
domain: Resource
range: Restriction
  on property: playsRole
  some values from: contact person role

contactPersonFor
type: ObjectProperty
definition: Specifying something a person can be contacted about.
domain: Restriction
  on property: playsRole
  some values from: contact person role
range: Resource

hasInformedConsent
type: ObjectProperty
definition: Specifying an informed consent of a legally adult human.
domain: legally adult human
range: informed consent

informedlyConsentsTo
type: ObjectProperty
definition: Specifying an action a legally adult human informedly consents to.
domain: legally adult human
range: Action