FOSTER or Friends Of Semantic Web Technology Resource
type: Ontology
creator: Hans Cools, MD; Agfa Healthcare/Belgium
contributor: Jos De Roo; Agfa Healthcare/Belgium. Until 2010: Pieterjan De Potter, Pedro Debevere; Ghent University - IBBT/ELIS - Multimedia Lab/Belgium.
publisher: Agfa Healthcare/Belgium
description: Formal description of general concepts.
format: OWL Full

group
type: Class
definition: Collection of things alike.
subclass of: Restriction
  on property: hasMember
  min cardinality: 2

level
type: Class
definition: Degree of something.

Language
type: Class
definition: A dynamic set of sensory signs, including sounds and gestures, of communication and the semantic, pragmatic, and grammar elements or rules used to manipulate them.
subclass of: Observable
subclass of: LinguisticSystem

Concept
in scheme: sct20080731
notation: 61909002

nationality
type: Class
definition: Belonging administratively to a certain nation.
subclass of: Observable

compound
type: DeprecatedClass
comment: Declared in <http://eulersharp.sourceforge.net/2003/03swap/physicalResource>
definition: Composed of more than 1 type of substance.
note: This can be anything, and is not meant in the sense of chemical compound containing more than 1 elementary substance or 'chemical element'. Chemical compound though is a subclass.
subclass of: PhysicalResource

product
type: DeprecatedClass
comment: Declared in <http://eulersharp.sourceforge.net/2003/03swap/physicalResource>
definition: Result of a production process.
subclass of: PhysicalResource

device
type: DeprecatedClass
comment: Declared in <http://eulersharp.sourceforge.net/2003/03swap/physicalResource>
definition: Something serving a particular purpose.
subclass of: PhysicalResource
subclass of: Agent
subclass of: SpatialResource

specimen
type: DeprecatedClass
comment: Declared in <http://eulersharp.sourceforge.net/2003/03swap/physicalResource>
definition: Sample containing a substance for examination.
subclass of: PhysicalResource

code
type: DeprecatedClass
definition: Applied or converted form of information wherein one thing(s) is(are) replaced by another thing(s).

confidentiality code
type: DeprecatedClass
definition: Code applied to something to protect its confidentiality.
subclass of: code

Summary
type: DeprecatedClass
type: Class
definition: The essentials of something.

hasMember
type: ObjectProperty
definition: Specifying a member of a group.
domain: group
range: Resource

memberOf
type: ObjectProperty
definition: Specifying a group something is a member of.
inverse of: hasMember
domain: Resource
range: group

hasLevel
type: ObjectProperty
definition: Specifying a level of something.
domain: Resource
range: level

refersTo
type: ObjectProperty
definition: Specifying something that is referred to by something else.
domain: Resource
range: Resource

hasLanguage
type: ObjectProperty
definition: Specifying a language related to something.
sub property of: language
domain: Resource
range: Language

hasNationality
type: ObjectProperty
definition: Specifying the nationality of a resource. A resource can have more than 1 nationality. It doesn't need to be the one of the country of origin nor the one of the country the resource is mostly present.
domain: Resource
range: nationality

hasCountry
type: ObjectProperty
definition: Specifying the country a nationality is linked to.
domain: nationality
range: Country

brand name
type: Property
definition: Specifying a name of a brand of something.
sub property of: name
domain: Resource
range: Literal

hasCode
type: DeprecatedProperty
type: ObjectProperty
type: InverseFunctionalProperty
comment: Declared in <http://eulersharp.sourceforge.net/2003/03swap/coding>
definition: Specifying a code for something.
domain: Resource
range: code

hasSKOSCode
type: DeprecatedProperty
type: DatatypeProperty
comment: Declared in <http://eulersharp.sourceforge.net/2003/03swap/coding>
definition: Specifying for an instance a code of a SKOS concept, within a SKOS scheme, matching exactly a class the instance is member of.
property chain axiom: type
property chain axiom: exactMatch
property chain axiom: notation

hasBroaderCode
type: DeprecatedProperty
type: DatatypeProperty
comment: Declared in <http://eulersharp.sourceforge.net/2003/03swap/coding>
definition: Specifying for an instance a code of a SKOS concept, within a SKOS scheme, matching broader a class the instance is member of.
property chain axiom: type
property chain axiom: broadMatch
property chain axiom: notation

codes
type: DeprecatedProperty
type: ObjectProperty
type: FunctionalProperty
comment: Declared in <http://eulersharp.sourceforge.net/2003/03swap/coding>
definition: Specifying something that has a code.
inverse of: hasCode

hasCodeSystem
type: DeprecatedProperty
type: FunctionalProperty
comment: Declared in <http://eulersharp.sourceforge.net/2003/03swap/coding>
definition: Specifying a name of a code system device serial number.
domain: code
range: Literal

hasCodeVersion
type: DeprecatedProperty
type: FunctionalProperty
comment: Declared in <http://eulersharp.sourceforge.net/2003/03swap/coding>
definition: Specifying a version of a code system.
domain: code
range: Literal

hasCodeValue
type: DeprecatedProperty
type: InverseFunctionalProperty
type: FunctionalProperty
comment: Declared in <http://eulersharp.sourceforge.net/2003/03swap/coding>
definition: Specifying a code value.
domain: code
range: Literal

hasCodeAuthority
type: DeprecatedProperty
comment: Declared in <http://eulersharp.sourceforge.net/2003/03swap/coding>
definition: Specifying an organization governing the code system, e.g. a government for a social security number.
domain: code
range: Literal

hasCodeExpirationDateTime
type: DeprecatedProperty
type: DatatypeProperty
type: FunctionalProperty
comment: Declared in <http://eulersharp.sourceforge.net/2003/03swap/coding>
definition: Specifying the date on which a code stops to be valid.
sub property of: expires
domain: code
range: dateTime

hasConfidentialityCode
type: DeprecatedProperty
comment: Declared in <http://eulersharp.sourceforge.net/2003/03swap/coding>
definition: Specifying a confidentiality code for something.
sub property of: hasCode
domain: Resource
range: confidentiality code

contains
type: DeprecatedProperty
comment: Declared in <http://eulersharp.sourceforge.net/2003/03swap/space>
definition: Specifying something physically contained by something else.
property chain axiom: member
domain: PhysicalResource
range: PhysicalResource

containedBy
type: DeprecatedProperty
comment: Declared in <http://eulersharp.sourceforge.net/2003/03swap/space>
definition: Specifying something physically containing something else.
inverse of: contains
domain: PhysicalResource
range: PhysicalResource

hasComplexity
type: DeprecatedProperty
comment: Declared in <http://eulersharp.sourceforge.net/2003/03swap/physicalResource>
definition: Specifying a physical organizational structure complexity of something.
domain: Resource
range: PhysicalResource

complexityOf
type: DeprecatedProperty
comment: Declared in <http://eulersharp.sourceforge.net/2003/03swap/physicalResource>
definition: Specifying something with a physical organizational structure complexity.
inverse of: hasComplexity