Document
type: Ontology
description: Formal general description of document.
creator: Hans Cools, MD, Agfa Healthcare/Belgium
contributor: Marc Twagirumukiza, MD, PhD, Agfa Healthcare/Belgium ; Until 2010: Pieterjan De Potter, Ghent University - IBBT/ELIS - Multimedia Lab/Belgium
publisher: Agfa Healthcare/Belgium
format: OWL-Full
comment: Copyright (c) 2009 Agfa-Gevaert Group and Ghent University - IBBT/ELIS - Multimedia Lab. All Rights Reserved. THIS IS UNPUBLISHED PROPRIETARY SOURCE CODE OF Agfa-Gevaert Group and Ghent University - IBBT/ELIS - Multimedia Lab The copyright notice above does not evidence any actual or intended publication of such source code.

content
type: Class
definition: See definition of http://www.ontologydesignpatterns.org/ont/web/irw.owl#InformationResource.
subclass of: InformationResource

document
type: Class
definition: See definition of <http://www.ontologydesignpatterns.org/cp/owl/informationrealization.owl#InformationRealization.
subclass of: InformationRealization

authoring
type: Class
definition: Taking responsibility for a content.
note: Different from creating a content
subclass of: Action
subclass of: Restriction
  on property: hasOutputObject
  some values from: content

author
type: Class
definition: Role of having responsibility for a document.
subclass of: Role
subclass of: Restriction
  on property: rolePlayedIn
  some values from: authoring

report
type: Class
definition: Content with focus on information communication.
subclass of: content

Record
type: Class
definition: Content with focus on information administration.
subclass of: content

letter
type: Class
definition: Directed report.
subclass of: report

summary report
type: Class
definition: Report containing the essentials of something.
subclass of: report

digital content
type: Class
definition: Content in electronic form as used by a digital computer.
subclass of: content

parent document
type: Class
definition: First grade progenitor of a content.
subclass of: content

deprecating
type: Class
definition: Marking a content as obsolete to warn against its use so that it may be phased out (www.thefreedictionary.com).
subclass of: Restriction
  on property: hasObject
  some values from: content
subclass of: Restriction
  on property: hasOutput
  some values from: deprecation

deprecation
type: Class
definition: A content made obsolete to warn against its use so it may be phased out (www.thefreedictionary.com).
subclass of: Restriction
  on property: outputOf
  some values from: deprecating

deprecated
type: Class
type: State
definition: Marked as obsolete to warn against its use so that it may be phased out (www.thefreedictionary.com).

image
type: Class
definition: Content as representation of a physical thing.
subclass of: content

data definition ontology
type: Class
definition: Direct formal representation of a data source structure.
comment: E.g. data base table column header as property, data base table as domain class, data base field as range class, data base field value as instance, row as instance graph.
subclass of: Ontology
subclass of: content

contains
type: ObjectProperty
definition: Specifying content of a document.
sub property of: realizes
domain: document
range: content

about
type: ObjectProperty
definition: Specifying something shown as a visual representation.
sub property of: hasObject
domain: content
range: Resource

hasLanguage
type: ObjectProperty
definition: Specifying a language wherein a content is represented.
domain: content
range: Language

hasHash
type: Property
definition: Specifying a hash of a digital content.
domain: digital content
range: Literal

hasSha1Hash
type: Property
sub property of: hasHash
definition: Specifying a RFCC 3174 US Secure Hash Algorithm 1 (SHA1) of a digital content
domain: digital content
range: Literal

hasMimeType
type: Property
definition: Specifying a standard Multipurpose Internet Mail Extensions type of a digital content.
domain: digital content
range: Literal

hasDigitalSize
type: ObjectProperty
definition: Specifying a digital size of a digital content.
domain: digital content
range: DigitalSize

hasParent
type: ObjectProperty
definition: Specifying a parent content of a content.
domain: content
range: content

replaces
type: ObjectProperty
definition: Specifying a content replaced by another.
domain: content
range: content

addedTo
type: ObjectProperty
definition: Specifying a content to which another is added.
domain: content
range: content

transformedTo
type: ObjectProperty
definition: Specifying a content transformed to another content.
domain: content
range: content

hasTitle
type: Property
definition: Specifying a title of a content.
sub property of: title
domain: content
range: Literal

hasDeprecator
type: ObjectProperty
definition: Specifying a deprecator acting in deprecating.
domain: deprecating
range: Restriction
  on property: playsRole
  some values from: Deprecator

deprecationOf
type: ObjectProperty
definition: Specifying a deprecation of a content.
sub property of: hasObject
domain: deprecation
range:
  subclass of: content
  subclass of: Restriction
    on property: hasState
    some values from: deprecated

whereinDeprecated
type: ObjectProperty
definition: Specifying a content deprecated in a deprecating.
sub property of: hasOutputObject
domain: deprecating
range:
  subclass of: content
  subclass of: Restriction
    on property: hasState
    some values from: deprecated

deprecatedIn
type: ObjectProperty
definition: Specifying a deprecating wherein a content is deprecated.
sub property of: outputObjectOf
inverse of: whereinDeprecated
domain:
  subclass of: content
  subclass of: Restriction
    on property: hasState
    some values from: deprecated
range: deprecating

deprecates
type: ObjectProperty
definition: Specifying a content a deprecator has deprecated.
domain: Restriction
  on property: playsRole
  some values from: Deprecator
range:
  subclass of: content
  subclass of: Restriction
    on property: hasState
    some values from: deprecated

deprecatedBy
type: ObjectProperty
definition: Specifying a deprecator of a deprecated content.
inverse of: deprecates
domain:
  subclass of: content
  subclass of: Restriction
    on property: hasState
    some values from: deprecated
range: Restriction
  on property: playsRole
  some values from: Deprecator

hasDeprecationDateTime
type: DatatypeProperty
type: FunctionalProperty
definition: Specifying a point in time of a deprecation of a content.
domain: deprecation
range: dateTime