Care
type: Ontology
creator: Hans Cools, MD; Agfa Healthcare/Belgium
contributor: Until 2010: Pieterjan De Potter; Ghent University - IBBT/ELIS - Multimedia Lab/Belgium
publisher: Agfa Healthcare/Belgium
description: Formal general description of human care.
format: OWL-Full

caring
type: Class
definition: Caring for a human.
subclass of: Action

care environment
type: Class
definition: Environment wherein a human is cared for.
subclass of: HumanCommunityEnvironment

home for the elderly
type: Class
definition: Environment wherein elderly are cared for.
subclass of: care environment

Concept
in scheme: sct20080731
notation: 257652008

caresFor
type: ObjectProperty
definition: Specifying a human a person cares for.
domain: Person
range: Human