Body Length
type: Ontology
creator: Hans Cools, MD; Pieterjan De Potter
publisher: Agfa Healthcare/Belgium, IBBT/Belgium, Multimedia Lab/Ghent University/Belgium
description: Formal description of the body length.
format: OWL Full
language: English

human body length
type: Class
definition: Human body length measured from the vertex to the sole of the foot in upright position.
subclass of: Length
subclass of: Observable
subclass of: Restriction
  on property: hasValue
  all values from: decimal
subclass of: Restriction
  on property: hasUnit
  all values from: Restriction
    on property: unitOf
    has value: Length
subclass of: SCTID_248334005

Concept
in scheme: sct20080731
notation: 248334005

measuring a human body length
type: Class
definition: Measurement of the length of a human body.
subclass of: Evaluation
subclass of: Restriction
  on property: hasObject
  all values from: Body
subclass of: Restriction
  on property: hasOutput
  all values from: human body length

hasLength
type: ObjectProperty
definition: Specifying a person's body length expressed in meters.
note: Used in N3 rules.
domain: Person
range:
  has value: decimal
  has unit:
    unit of: Length